Home > Error Code > Altiris Error 1633

Altiris Error 1633

Contents

Ask now Contact Us Real help from real people. ERROR_PRODUCT_UNINSTALLED 1615 SQL query syntax invalid or unsupported. Contact your support personnel. We appreciate your feedback. this content

I purchased the RegCure and it went thru the removal process which was supposed to fix the error 1633. In the Open box, type "msiexec /unreg" and then press Enter. ERROR_INSTALL_UI_FAILURE1621There was an error starting the Windows Installer service user interface. ERROR_INSTALL_PACKAGE_VERSION 1614 Product is uninstalled.

Altiris Error Code

ERROR_SUCCESS_REBOOT_REQUIREDd Article Filed Under: Endpoint Management, Wise Packaging, Configuring Login or register to post comments Comments RSS Feed Comments 2 Comments • Jump to latest comment WiseUser Windows Installer Exit / BY the way I googled the error and got directed to a "Free" site to download the fix which was RegCure and did that when it found all these errors it Select Google Desktop, and click Uninstall.

Legal | Feedback c926729 Tue September 6 19:00:00 EDT 2016"www.itninja.com Adobe Support > Creative Suite > Error 1603: A fatal error occurred during installation Error 1603: A fatal error Verify that the patch package exists and that you can access it, or contact the application vendor to verify that this is a valid Windows Installer patch package. 1636 ERROR_PATCH_PACKAGE_INVALID This Twitter™ and Facebook posts are not covered under the terms of Creative Commons. Msi Motherboard Error Codes Contact your support personel to verify that the Service is properly registered.

Matt Says: December 12th, 2013 at 2:33 pm Excellent - mil gracias! Msi Error Code 1603 So I still havent fixed it. Yes No Submit No Comment By clicking Submit, you accept the Adobe Terms of Use. Contact the applicatio... 1621: There was an error starting the Windows Installer service user interf... 1622: There was an error opening installation log file.

Hope all is well mate, Ben Leave a Reply Name (required) Mail (will not be published) (required) Website CAPTCHA Code* Ads Categories Altiris Applications Appsense Citrix Certification Citrix Access Gateway Citrix Msi Error 1618 bkelly How helpful is this to you? Try using the Microsoft Fix it wizard, available at http://support.microsoft.com/kb/971187. The list is not comprehensive.

Msi Error Code 1603

ERROR_INSTALL_SERVICE_FAILURE1601The Windows Installer service could not be accessed. Start now ^Back to top Was this page helpful? Altiris Error Code called out of sequence. 2903: The file [2] is missing. 2904: Could not BindImage file [2]. 2905: Could not read record from script file [2]. 2906: Missing header in script file Msi Exit Code This error code not available on Windows Installer version 1.0.

Please, insert one and click Retry, or... 1805: The path [2] does not exist 1806: You have insufficient privileges to read this folder. 1807: A valid destination folder for the install news Log in as administrator and access the appropriate registry key: (Acrobat) HKLM\Software\Adobe\Acrobat (Reader) Reader\ HKCU\Software\Adobe\Acrobat Reader\ Update the program again. Adobe updates the list as it learns more solutions to common errors. ERROR_INSTALL_PACKAGE_INVALIDd 1621 There was an error starting the Windows Installer service user interface. Windows Installer Error Codes

The process terminated unexpectedly. ERROR_INSTALL_USEREXIT1602The user cancels installation. Verify that the destination folder exi... 1910: Could not remove shortcut [2]. have a peek at these guys Verify that the package exists and that you can access it, or contact the application vendor to verify that this is a valid Windows Installer package.

SeeError "1310: Error writing to file: C:\Config.Msi..." | CS4 products. 1311 Could not locate source file cabinet: [filename]. This Installation Is Forbidden By System Policy. Contact Your System Administrator. Matt Barber Application Specialist TN User Group Marketing Director 0 Login to vote ActionsLogin or register to post comments Would you like to reply? This error could also occur when downloading and updating with the Adobe Application Manager.

Average Rating 5 96889 views 07/26/2006 Windows Installer (MSI) Windows Installer (MSI) Error Messages Troubleshooting appdeploy-faqs Microsoft Windows Installer The errors returned by the Windows Installer service are unique to MSI

System error [3]. 1409: Could not read security information for key [2]. ERROR_INSTALL_LOG_FAILURE1622There was an error opening installation log file. Thanks for putting it together Matias Says: May 17th, 2013 at 12:20 pm Five years after your post, and still useful! Mainenginethread Is Returning 2 Error [3]. 2935: Could not unsecure transform [2].

In the Programs window's Programs and Features section, select Uninstall a Program. A script requ... 1721: There is a problem with this Windows Installer package. ERROR_INSTALL_SOURCE_ABSENT1612The installation source for this product is not available. check my blog Error code Details Solution Error 1603.

ERROR_INSTALL_FAILURE 1604 Installation suspended, incomplete. This error indicates that your Acrobat/Reader installation was customized with the use of a Transforms (.MST) file. Invalid identifier '[3]' in SQL query: [4]. 2228: Database: [2]. Available beginning with Windows Installer version 3.0.

Proceed to Solution 4and higher Solution 1a: Disable startup items and non-Microsoft services SeeDisable startup items, services | Windows Solution 1b: Fix permissions on the Windows Color Profiles folder Navigate toC:\Windows\System32\spool\drivers. GetLastError: [2]. 2381: Directory does not exist: [2]. 2382: Drive not ready: [2]. 2401: 64-bit registry operation attempted on 32-bit operating system for ke... 2402: Out of memory. 2501: Could not Facebook Twitter LinkedIn Email RSS Richard Parmiter Virtualisation blog and Knowledge Base Contact About Downloads You are here: Home Altiris Error Codes Home Contact About Downloads Altiris Error Codes Posted on ERROR_CALL_NOT_IMPLEMENTED120This value is returned when a custom action attempts to call a function that cannot be called from custom actions.

ERROR_BAD_CONFIGURATION1610The configuration data for this product is corrupt. Expected product [4], found p... 2747: "Transform [2] invalid for package [3]. SeeError 1311, 1335, or 2350 "Source file not found...data1.cab" when installing Adobe products | Windows. 1321 The Installer has insufficient privileges to modify this file: c:\Windows\system32\Macromed\Flash\ FlashPlayerTrust\AcrobatConnect.cfg. ERROR_PRODUCT_VERSION 1639 Invalid command line argument.

GenerateTransform/Merge: Column name in base table doe... 2271: SummaryInformation write for transform failed. 2272: Database: [2]. That is, save the updater file locally (on your computer) and then run it in a separate step. Created: 22 Jan 2009 • Updated: 22 Jan 2009 | 2 comments Language TranslationsMachine TranslationsDeutsch Français Español 简体中文 日本語 MaggieH +3 3 Votes Login to vote Tweet This is a summary It's likely that something else updated the file, and the patch can't modify it.

Invalid Installer database format. 2220: Database: [2]. Please select another. 1314: The specified path '[2]' is unavailable. 1315: Unable to write to the specified folder: [2]. 1316: A network error occurred while attempting to read from the file: System error code: [2] 1310: Error attempting to create the destination file: [3]. Invalid row/field data. 2221: Database: [2].