Home > Error Code > Altiris Error 1602 During Script Execution

Altiris Error 1602 During Script Execution

Contents

Read here) and is a general error code that indicates a problem occurred during the installation. ERROR_INSTALL_NOTUSED1634Component is not used on this machine. To... 1703: For the configuration changes made to [2] to take effect you must res... 1704: An install for [2] is currently suspended. Reason: Member has been banned from the site For more information, visit our FAQ's. check over here

GetLastError: [2]. 2334: Error converting file time to local time for file: [3]. Transaction not started. 2765: Assembly name missing from AssemblyName table : Component: [4]. 2766: The file [2] is an invalid MSI storage file. 2767: No more data{ while enumerating [2]}. 2768: Local System account, Administrator, or a specific user? ERROR_FILE_NOT_FOUND That's what your error code means. http://www.symantec.com/connect/articles/windows-installer-exit-error-codes-log-files

Altiris Error 1 During Script Execution

Windows Installer Exit / Error Codes in Log Files! Reply July 5, 2014 at 5:48 PM globatechhub says: Get Expert advise and QuickBooks support to manage and Grow your Business. ERROR_UNKNOWN_PROPERTY 1609 Handle is in an invalid state. Style Altirigos Contact Us Home Top RSS Forum software by XenForo™ ©2011 XenForo Ltd.

Verify that the patch package exists and that you can access it, or contact the application vendor to verify that this is a valid Windows Installer patch package. 1636 ERROR_PATCH_PACKAGE_INVALID This ERROR_APPHELP_BLOCK 1601 The Windows Installer service could not be accessed. msiexec /i setup.msi /l*v c:\temp\msi.log Step 2: Open the verbose log in a text editor such as notepad and search for the string "return value 3". Msi Error Code 1603 ERROR_PATCH_PACKAGE_INVALID1636This patch package could not be opened.

Can anyone tell me what this error means? Error saving database tables. 2214: Database: [2]. ERROR_PATCH_PACKAGE_OPEN_FAILED1635This patch package could not be opened. ERROR_INVALID_DATA13The data is invalid.

System error: [3]. 2261: Could not remove stream [2]. Windows Installer Error Codes Table... 2252: Database: [2] Transform: Cannot add existing table. Contact your supp... 1611: The component qualifier not present. 1612: The installation source for this product is not available. What do the various Windows Installer (MSI) error codes mean?

Altiris Error 2 During Script Execution

You must complete that installat... 1501: Error accessing secured data. find more info If you can verify that running the file locally works then it may just be an informational output and can be added to your error codes list and continue on. Altiris Error 1 During Script Execution Answers 7 -2147287038: %1 could not be found. 13: The data is invalid. 120: This function is not available for this platform. Error 255 During Script Execution Altiris Ther... 2811: "On dialog [2] control [3] has to take focus, but it is unable to do ... 2812: The event [2] is not recognized. 2813: "The EndDialog event was called

Contact your support personnel. check my blog ERROR_INSTALL_PLATFORM_UNSUPPORTED1633This installation package is not supported on this platform. Table: ... 2226: Database: [2]. ERROR_PATCH_MANAGED_ADVERTISED_PRODUCT 1651Administrative user failed to apply patch for a per-user managed or a per-machine application that is in advertise state. Altiris Error Code

Database not in writable state. 2213: Database: [2]. Verify that the source exists and that you can access it. System error: [3]. 2262: Stream does not exist: [2]. http://bsnux.com/error-code/altiris-script-error-9009.html System error code: [2] 1310: Error attempting to create the destination file: [3].

ERROR_INSTALL_PACKAGE_OPEN_FAILED1619This installation package could not be opened. Msi Error Codes GetLastError: [3]. 2372: Patch file [2] is corrupt or of an invalid format. A value of 1 indicates that this functionality is disabled.

Verify that the Temp folder exists and that you can write to it.

ERROR_PATCH_TARGET_NOT_FOUND 1643 The patch package is not permitted by system policy. ERROR_PRODUCT_VERSION 1639 Invalid command line argument. Verify that the packag... 1620: This installation package could not be opened. Msi Motherboard Error Codes One member reports having received this error installing MSN Messenger 6.2.

The installation cannot co... 2352: Could not initialize cabinet file server. Thats what makes this so confusing is that there are no errors shown. Import file format error: [3], Line [4]. 2217: Database: [2]. have a peek at these guys By reading the Litronic KB and making some educated guesses, I wrote a script that copies the INI file to the "%windir%\temp" folder, and then calls the necessary MSI.

ERROR_INVALID_PARAMETER87One of the parameters was invalid. One can find that the biggest hurdle to debugging a failed setup is often zeroing in on which part of the setup is actually failing, and this trick of searching for A program run... 1723: There is a problem with this Windows Installer package. Contact your technical su... 1715: Installed [2]. 1716: Configured [2]. 1717: Removed [2]. 1718: File [2] was rejected by digital signature policy. 1719: Windows Installer service could not be accessed.

This message is indicative of a success. Available beginning with Windows Installer version 3.0. Legal | Feedback c926729 Tue September 6 19:00:00 EDT 2016"www.itninja.com Skip to content Skip to content Search for: Menu Skip to content Enterprise Tech Microsoft Windows Windows Installer, Application Could not load table '[3]' in SQL query: [4]. 2230: Database: [2].

Insufficient parameters for Execute. 2209: Database: [2]. ERROR_INSTALL_PACKAGE_INVALID1620This installation package could not be opened. This message is indicative of a success. Newer Than: Search this thread only Search this forum only Display results as threads Useful Searches Recent Threads More...

The sign... 1938: An error occurred during the installation of assembly '[6]'. Answered 01/31/2008 by: smpmet Please log in to comment Please log in to comment 1 Received Error 1603 deploying UGS NX 5 msi via Altiris Deployment Solution. GetLastError: [2]. 2333: Error setting file attributes. Insufficient values in INSERT SQL statement. 2240: Database: [2].

ERROR_INSTALL_UI_FAILURE1621There was an error starting the Windows Installer service user interface. Regards, Jason 0 Adam Ruth September 21, 2011 20:32 "User cancelled installation" is MSI error code 1602 which it appears Adobe has (annoyingly) decided to also use for some other problem, Action ended 14:14:58: INSTALL. The function returns the value ERROR_CALL_NOT_IMPLEMENTED.

The Microsoft Windows Installer Service is not installed correctly. System error [3]. 1408: Could not get sub key names for key [2]. ERROR_FUNCTION_NOT_CALLED 1627 Function failed during execution. Any Good Papers On Use of Virtual Machines?