Home > Altiris Error > Altiris Error Codes 1

Altiris Error Codes 1

Contents

rio, Mar 17, 2005 #1 JAustgen Site Administrator (Ex-SQL Savant) I'm trying to remember off the top of my head... The script is correctly executing as VBS, but the syntax in the VBS is in error. Try these resources. jdean, Mar 24, 2005 #11 LordofthePatch Site Administrator It is actually when you specify the script to be run. check over here

This does not include installs where the ForceReboot action is run.       Show: Inherited Protected Print Export (0) Print Export (0) Share IN THIS ARTICLE Is this page helpful? The entrypoint should be declared as WINAPI or STDCALL. Connect Etiquette: Please "Mark as Solution" posts that fix your problem. +1 Login to vote ActionsLogin or register to post comments Would you like to reply? ERROR_SUCCESS_REBOOT_INITIATED1641The installer has initiated a restart. http://www.symantec.com/connect/forums/error-1-during-script-execution

Altiris Error Code 1603

If you're going by memory of what you did for MR4 you'd miss it. Authorised Symantec Consultant (ASC) with Endpoint Management Limited, an Authorised Symantec Delivery Provider based in the UK. Either it is retried after the containing onode is moved or the extent stream is converted to a large stream. [ERROR_CONVERT_TO_LARGE (0x258)]Error Code 601: The attempt to find the object found

ERROR_PATCH_PACKAGE_OPEN_FAILED1635This patch package could not be opened. Selecting OK will cause the service to continue operation. Submit a Threat Submit a suspected infected fileto Symantec. Altiris Error 1619 If you choose to participate, the online survey will be presented to you when you leave the Technet Web site.Would you like to participate?

I can look tomorrow, though. Altiris Failure Return Code 1 MySymantec Create and manage cases, manage licensing and renewals, submit threats, and enroll with Symantec Rewards. At least I will not be driving blind! Friday, March 26, 2010 8:52 PM Reply | Quote 0 Sign in to vote yeah, we get that too.

Please try to save this file elsewhere. [ERROR_LOST_WRITEBEHIND_DATA (0x254)]Error Code 597: The parameter(s) passed to the server in the client/server shared memory window were invalid. Altiris Error 1618 The registry could not read in or write out or flush one of the files that contain the system's image of the registry. [ERROR_REGISTRY_IO_FAILED (0x3F8)]Error Code 1017: The system has attempted In the situation where this was seen, the Run Script would run when using the FQDN of the DS in place of the token but would not run when using the During this process [ERROR_COMMITMENT_MINIMUM (0x27B)]Error Code 636: A device was removed so enumeration must be restarted. [ERROR_PNP_RESTART_ENUMERATION (0x27C)]Error Code 637: {Fatal System Error} The system image %s is not properly signed.

Altiris Failure Return Code 1

This spreadsheet lists all the … […] Beheben Altiris Deployment Lösung Fehler 1618 Says: March 18th, 2015 at 3:57 am […] Altiris Error Codes | Richard Parmiter – This spreadsheet lists http://www.parmiter.com/altiris/2008/08/RP112 How Can I Use Tokens to Create Computer-specific Files? Altiris Error Code 1603 This device will not be used. Altiris Error 1603 During Script Execution Solution To correct these errors, the script must be corrected.

Thank you for sharing your knowledge! \o/ RP Says: May 18th, 2013 at 12:37 am Glad to be of help! check my blog With the "", it runs beautifully. Retry transaction after doing so. [ERROR_ALLOCATE_BUCKET (0x25A)]Error Code 603: The user/kernel marshalling buffer has overflowed. [ERROR_MARSHALL_OVERFLOW (0x25B)]Error Code 604: The supplied variant structure contains invalid data. [ERROR_INVALID_VARIANT (0x25C)]Error Code 605: The The first attachment is for Altiris 6.X Error Codes, nicely categorized by sheetsand the explanationsandwill cover the following: DS Firm Errors DS RapiDeploy Errors DS PXE Errors DS AClient Errors DS Altiris Error 3010

Available beginning with Windows Installer version 4.0. Contact the application vendor to verify that this is a valid Windows Installer package. The stack pointer has been left in an inconsistent state. this content In Altiris as well as MDT.

Contact Us Customer and Technical Support phone numbers and hours of operation. Altiris Error 2 logo-symantec-dark-source Loading Your Community Experience Symantec Connect You will need to enable Javascript in your browser to access this site. © 2016 Symantec Connect Endpoint Management > Downloads Entire Site Search What is a Device Manager Error Code?

If you're using the %DSSERVER% token within your script.

As Amador states, make sure you use double quotes when there are spaces in folder and/or file names. Contact your support personnel to verify that the Windows Installer service is properly registered. ERROR_INSTALL_PACKAGE_INVALID1620This installation package could not be opened. Error During Script Execution Create a SymAccount now!' DS Run Script task gives "Error 1 during script execution" TECH12237 February 1st, 2007 http://www.symantec.com/docs/TECH12237 Support / DS Run Script task gives "Error 1 during script execution"

You can also use the 8.3 standard on local files/folders (not sure about shares). What is the difference between "Deployment Solution" and "Deployment Server"? Join a real-time chat and ask the experts. have a peek at these guys ERROR_INSTALL_SERVICE_FAILURE1601The Windows Installer service could not be accessed.

Verify that the package exists and is accessible, or contact the application vendor to verify that this is a valid Windows Installer package. jdean, Mar 29, 2005 #18 (You must log in or sign up to reply here.) Show Ignored Content Share This Page Tweet Your name or email address: Password: Forgot your password? jdean, Mar 17, 2005 #8 mad.manu New Member Gosh! For more error codes returned by the Windows Installer, see Windows Installer Error Messages.Note  The error codes ERROR_SUCCESS, ERROR_SUCCESS_REBOOT_INITIATED, and ERROR_SUCCESS_REBOOT_REQUIRED are indicative of success.

It is corrupt [ERROR_CANNOT_LOAD_REGISTRY_FILE (0x24D)]Error Code 590: {Unexpected Failure in DebugActiveProcess} An unexpected failure occurred while processing a DebugActiveProcess API request. Without the "" it reads the space as an end of line. Also, Error 255 has been related to this. I am getting errors in Altiris when pushing out IE10 that do not correspond with the typical error list.

To restore access to this installation of Windows [ERROR_EVALUATION_EXPIRATION (0x26E)]Error Code 623: {Illegal System DLL Relocation} The system DLL %hs was relocated in memory. Check your computer's system information to see whether you need a x86 (32-bit) or x64 (64-bit) version of the program, and then contact the software publisher. [ERROR_EXE_MACHINE_TYPE_MISMATCH (0xD8)]Error Code 217: The ERROR_INSTALL_NOTUSED1634Component is not used on this machine. Help Forums Forums Quick Links Search Forums What's New?

Don't have a SymAccount?