Home > Altiris Error > Altiris Error Code 1620

Altiris Error Code 1620

Contents

You must install a Windows service pack that contains a newer version of the Windows Installer service. For information about network troubleshooting, see Windows Help. 1257 The security identifier provided is not from an account domain. 1258 The security identifier provided does not have a domain component. 1259 This error has been reported to occur as a result of other running programs (such as anti-virus software). ERROR_INSTALL_REMOTE_DISALLOWEDd 1641 The installer has started a reboot. check over here

ERROR_INSTALL_SERVICE_FAILURE1601The Windows Installer service could not be accessed. This message is indicative of a success. Installation of this version cannot continue. You must install a Windows service pack that contains a newer version of the Windows Installer service.

Altiris Error Code 1603

This error code is returned if the user chooses not to try the installation. ERROR_CALL_NOT_IMPLEMENTED120This value is returned when a custom action attempts to call a function that cannot be called from custom actions. The value provided for the new password contains values that are not allowed in passwords. 1325 Unable to update the password. You must install a Windows service pack that contains a newer version of the Windows Installer service.

This can be caused by the corruption of the MSI file. Consult the Windows Installer SDK for detailed command line help. Possible reasons are blank passwords not allowed, logon hour restrictions, or a policy restriction has been enforced. 1328 Logon failure: account logon time restriction violation. 1329 Logon failure: user not allowed Altiris Error 1619 The specified service does not exist. 1246 Continue with work in progress. 1247 An attempt was made to perform an initialization operation when initialization has already been completed. 1248 No more

Downloads and tools Windows 10 dev tools Visual Studio Windows SDK Windows Store badges Essentials API reference (Windows apps) API reference (desktop apps) Code samples How-to guides (Windows apps) Learning resources Altiris Error Code 1 The value provided as the current password is incorrect. 1324 Unable to update the password. or login Share Related Questions iTunes 12.5.1 and iTunesPrefs.XML Can clients switch between Kace servers (one in a DMZ), using the same database? http://www.symantec.com/connect/articles/windows-system-error-codes-exit-codes-description Generated Thu, 29 Sep 2016 22:01:09 GMT by s_hv997 (squid/3.5.20)

Was a full backup done before? 4004 The backup failed. Altiris Error 1618 Contact your support personnel to verify that the Windows Installer service is properly registered. ERROR_PATCH_TARGET_NOT_FOUND 1643 The patch package is not permitted by system policy. ERROR_INSTALL_SUSPEND 1605 This action is only valid for products that are currently installed.

Altiris Error Code 1

Available beginning with Windows Installer version 3.0. This Site This error will show this message: "This installation package could not be opened. Altiris Error Code 1603 Installation of this version cannot continue. Altiris Error 1603 During Script Execution Please contact your system administrator.

Consult the Windows Installer SDK for detailed command line help. 3010 ERROR_SUCCESS_REBOOT_REQUIRED A restart is required to complete the install. check my blog ERROR_PATCH_REMOVAL_UNSUPPORTED1646The patch package is not a removable patch package. Complete that installation before proceeding with this install. ERROR_INSTALL_USEREXIT 1603 Fatal error during installation. Altiris Error 3010

Notify me of new posts by email. Click Here To Download A Free Scan

Important update! Created and staffed by volunteer Altiris admins, the IRC #Altiris chat room is your place for solutions. this content Windows System Error Codes (exit codes) Description Created: 28 Jan 2009 • Updated: 20 Dec 2010 | 9 comments Language TranslationsMachine TranslationsDeutsch Français Español 简体中文 日本語 Sidd +19 19 Votes Login

This will not only allow your system to run much smoother, but also ensure that you're going to be able to get a fresh copy of the software for your PC. Error Code 1620 Psexec The file to be replaced has been renamed using the backup name. 1178 The volume change journal is being deleted. 1179 The volume change journal is not active. 1180 A file These tasks will return exit/error codes when log file is generated.

Verify that the Temp folder exists and that you can write to it.

Available beginning with Windows Installer version 3.0. ERROR_INSTALL_FAILURE 1604 Installation suspended, incomplete. Available beginning with Windows Installer version 3.0. Altiris Error Codes Verify that the specified transform paths are valid.

Contact your support personnel. 1632 ERROR_INSTALL_TEMP_UNWRITABLE The temp folder is either full or inaccessible. ERROR_INVALID_PARAMETER 120 This function is only available for Win 2000 and Windows XP with Windows Installer v2.0. Legal | Feedback c926729 Tue September 6 19:00:00 EDT 2016"www.itninja.com msi errors .com Software Packaging Tips and Tricks Menu Skip to content HomeAboutDownloadsGoogle Chrome Search Knowledge baseMSI Windows Installer have a peek at these guys ERROR The requested URL could not be retrieved The following error was encountered while trying to retrieve the URL: http://www2.gkcd.cn/d/tag/Altiris-Error-1620 Read Error The system returned: (104) Connection reset by peer An

We have found that this tool has consistently the most effective and versatile, allowing you to quickly fix most problems on your PC. You can use this cleaner to stop viruses, errors and faults with your system. ERROR_INSTALL_SUSPEND1604Installation suspended, incomplete. Verify that the specified transform paths are valid.

It may not be formatted. 1786 The workstation does not have a trust secret. 1787 The security database on the server does not have a computer account for this workstation trust Toggle navigation Software Tips Questions Blogs Links Communities Questions & Answers Help with MSI 1620 Help with MSI 1620 AppDeploy.com How helpful is this to you? ERROR_SUCCESS_REBOOT_INITIATEDd 1642 The installer cannot install the upgrade patch because the program being upgraded may be missing or the upgrade patch updates a different version of the program. You may not bring the quorum resource offline or modify its possible owners list. 5069 The cluster quorum resource is not allowed to have any dependencies. 5070 The cluster node is

Use your global user account or local user account to access this server. 1809 The account used is a server trust account. ERROR_INSTALL_FAILURE1603A fatal error occurred during installation. Verify that the temp folder exists and that you can write to it. 1633 ERROR_INSTALL_PLATFORM_UNSUPPORTED This installation package is not supported on this platform. This error is going to be caused by Windows Installer being unable to load up correctly.

ERROR_UNSUPPORTED_TYPE1630Data of this type is not supported. Changes will not be effective until the service is restarted. 3012 No printers were found. 3013 The printer driver is known to be unreliable. 3014 The printer driver is known to To configure or remove the existing version of this product, use Add/Remove Programs on the Control Panel. 1639 ERROR_INVALID_COMMAND_LINE Invalid command line argument. Consult the Windows Installer SDK for detailed command line help. 1640 Only administrators have permission to add, remove, or configure server software during a Terminal Services remote session.

Verify that the program to be upgraded exists on your computer and that you have the correct upgrade patch. If Windows still cannot find the network path, contact your network administrator. 52 You were not connected because a duplicate name exists on the network. ERROR_UNKNOWN_PROPERTY1608This is an unknown property. Sign up today to participate, stay informed, earn points and establish a reputation for yourself!