Home > Altiris Error > Altiris Error Code 1326

Altiris Error Code 1326

Contents

Contact your support... 1720: There is a problem with this Windows Installer package. Wednesday, July 21, 2010 1:54 AM Reply | Quote 0 Sign in to vote I encountered exactly the same problem. System error [3]. 1408: Could not get sub key names for key [2]. Contact your product vendor. ERROR_INSTALL_NOTUSED 1634 (0x662) Component not used on this computer. ERROR_PATCH_PACKAGE_OPEN_FAILED 1635 (0x663) This update package could not be opened. check over here

Invalid Installer database format. 2220: Database: [2]. Please select another. 1314: The specified path '[2]' is unavailable. 1315: Unable to write to the specified folder: [2]. 1316: A network error occurred while attempting to read from the file: We appreciate the input. Windows System Error Codes (exit codes) Description Created: 28 Jan 2009 • Updated: 20 Dec 2010 | 9 comments Language TranslationsMachine TranslationsDeutsch Français Español 简体中文 日本語 Sidd +19 19 Votes Login check my site

Altiris Error Code 1603

The system will be restarted so the changes can take effect. 1642 The upgrade patch cannot be installed by the Windows Installer service because the program to be upgraded may be Contact your... 1916: Error installing ODBC driver manager, ODBC error [2]: [3]. If you are not able to troubleshoot please post the text here we will look forward with you.

Reason: Member has been banned from the site For more information, visit our FAQ's. Just something to throw out... This may happen if the resource is in a pending state. 5085 A non locker code got a request to reserve the lock for making global updates. 5086 The quorum disk Altiris Error 1619 Contact your support personnel. ERROR_INSTALL_LOG_FAILURE 1622 (0x656) Error opening installation log file.

You may not bring the quorum resource offline or modify its possible owners list. 5069 The cluster quorum resource is not allowed to have any dependencies. 5070 The cluster node is Altiris Error Code 1 The value provided for the new password does not meet the length, complexity, or history requirements of the domain. ERROR_LOGON_FAILURE 1326 (0x52E) The user name or password is incorrect. Resolution: To resolve this issue, you will need to grant the account in question the following user rights in the local security policy (or domain security policy if on a Domain https://support.symantec.com/en_US/article.TECH13833.html Must restart ... 1903: Scheduling restart operation: Deleting file [2].

The Win2000 domain computer I wanted to connect said 10:32 AM while my Win7 computer said 9:43 AM. Altiris Error 1618 Table does not exist: [3]. 2206: Database: [2]. Free up space on the drive or verify that you have write permission on the Temp folder. 1633 This installation package is not supported by this processor type. I must be getting slow, this one took an hour to figure out….

Altiris Error Code 1

Privacy statement  © 2016 Microsoft. https://support.microsoft.com/en-us/kb/130995 Tha... 1601: The Windows Installer Service Could Not Be Accessed 1601: The Windows Installer service could not be accessed. Altiris Error Code 1603 Table: [3]. 2251: Database: [2] Transform: Cannot delete row that does not exist. Altiris Error 1603 During Script Execution Please log in to comment Rating comments in this legacy AppDeploy message board thread won't reorder them,so that the conversation will remain readable.

TextThis open question is a holding place for the answer below which provides links to a page detailing each of the internal errors you may encounter when working with Windows Installer.Save check my blog System error: [3]. 2262: Stream does not exist: [2]. Wednesday, April 29, 2009 2:43 PM Reply | Quote 1 Sign in to vote Hi there, I went though the netsetup.log that you post. I found these lines:04/29/2009 10:19:45:981 NetpDsGetDcName: found DC '\\CHRISTINA.omniacs.com' in the specified domain04/29/2009 10:19:46:300 NetUseAdd to \\CHRISTINA.omniacs.com\IPC$ returned 1326Note: DC CHRISTINA.omniacs.com can be located, however after the domain controller was found, an attempt Altiris Error 3010

Script version: [3], minimum version... 2927: ShellFolder id [2] is invalid. 2928: Exceeded maximum number of sources. Contact your support personnel for assistance. ERROR_INSTALL_USEREXIT 1602 (0x642) User cancelled installation. ERROR_INSTALL_FAILURE 1603 (0x643) Fatal error during installation. ERROR_INSTALL_SUSPEND 1604 (0x644) Installation suspended, incomplete. ERROR_UNKNOWN_PRODUCT 1605 Merge: There were merge conflicts reported in [3] tabl... 2269: Database: [2]. this content This message is indicative of ... 1642: The installer cannot install the upgrade patch because the program be... 1643: The patch package is not permitted by system policy.

This attempt failed with error code 1326 (ERROR_LOGON_FAILURE), which indicates that the credentials that you use do not have sufficient access rights for connecting to the domain controller.Root cause:This is properly a domain Altiris Error 2 MergeDatabase: Unable to write errors to Error table. ... 2275: Database: [2]. Verify that y... 1927: The installation requires COM+ Services to be installed. 1928: The installation failed to install the COM+ Application. 1929: The installation failed to remove the COM+ Application. 1930:

The System Error Codes are very broad.

The description of codes may help in identifying and troublshooting the issues. Contact your system administrator. ERROR_FUNCTION_NOT_CALLED 1626 (0x65A) Function could not be executed. ERROR_FUNCTION_FAILED 1627 (0x65B) Function failed during execution. ERROR_INVALID_TABLE 1628 (0x65C) Invalid or unknown table specified. Verify tha... 1613: This installation package cannot be installed by the Windows Installe... 1614: The product is uninstalled. 1615: The SQL query syntax is invalid or unsupported. 1616: The record field Error Code 1326 Group Policy Could not load table '[3]' in SQL query: [4]. 2230: Database: [2].

One lucky winner will receive 500 Connect points! * Take the survey. Normally caused by an uninitialized register. Global mutex not properly initialized. 2762: Cannot write script record. have a peek at these guys Answer Summary: This open question is a holding place for the answer below which provides links to a page detailing each of the internal errors you may encounter when working with

Error: '[2]'. 2609: Attempt to migrate product settings before initialization. 2611: "The file [2] is marked as compressed, but the associated media entry... 2612: Stream not found in '[2]' column.